Target
RecBCD enzyme subunit RecD
Ligand
BDBM48080
Substrate
Meas. Tech.
Counterscreen for AddAB inhibitors: absorbance-based bacterial cell-based high throughput dose response assay to identify inhibitors of RecBCD
IC50
>118473±n/a nM
Citation
 PubChem, PC Counterscreen for AddAB inhibitors: absorbance-based bacterial cell-based high throughput dose response assay to identify inhibitors of RecBCD PubChem Bioassay (2010)[AID] 
Target
Name:
RecBCD enzyme subunit RecD
Synonyms:
RECD_ECOLI hopE | recD
Type:
Enzyme Catalytic Domain
Mol. Mass.:
66906.68
Organism:
Escherichia coli str. K-12 substr. MG1655
Description:
gi_16130723
Residue:
608
  
Inhibitor
Name:
BDBM48080
Synonyms:
(1Z)-1-(2-pyridinylhydrazinylidene)-2-naphthalenone (1Z)-1-(pyridin-2-ylhydrazinylidene)naphthalen-2-one MLS000540127 cid_5359275
Type:
Small organic molecule
Emp. Form.:
C15H11N3O
Mol. Mass.:
249.2673
SMILES:
Oc1ccc2ccccc2c1N=Nc1ccccn1
: