Target
Mitochondrial import inner membrane translocase subunit TIM10
Ligand
BDBM78181
Substrate
Meas. Tech.
Dose Response confirmation of uHTS small molecule inhibitors of tim10-1 yeast via a luminescent assay
IC50
6400±n/a nM
Citation
 PubChem, PC Dose Response confirmation of uHTS small molecule inhibitors of tim10-1 yeast via a luminescent assay PubChem Bioassay (2010)[AID] 
Target
Name:
Mitochondrial import inner membrane translocase subunit TIM10
Synonyms:
MRS11 TIM10_YEAST TPA: Essential protein of the mitochondrial intermembrane space, forms a complex with Tim9p (TIM10 complex) that delivers hydrophobic proteins to the TIM22 complex for insertion into the inner ...
Type:
Enzyme Catalytic Domain
Mol. Mass.:
10303.50
Organism:
Saccharomyces cerevisiae S288c
Description:
gi_285809906
Residue:
93
  
Inhibitor
Name:
BDBM78181
Synonyms:
(E)-3-(3-Benzotriazol-1-ylmethyl-4-methoxy-phenyl)-1-phenyl-propenone (E)-3-[3-(benzotriazol-1-ylmethyl)-4-methoxy-phenyl]-1-phenyl-prop-2-en-1-one MLS000589828 cid_6184004
Type:
Small organic molecule
Emp. Form.:
C23H19N3O2
Mol. Mass.:
369.4159
SMILES:
COc1ccc(\C=C\C(=O)c2ccccc2)cc1Cn1nnc2ccccc12
: