Target
Voltage-dependent T-type calcium channel subunit alpha-1H
Ligand
BDBM76864
Substrate
Meas. Tech.
Inhibitors of T-Type Calcium Channels
EC50
9498±n/a nM
Citation
 PubChem, PC Inhibitors of T-Type Calcium Channels PubChem Bioassay (2011)[AID] 
Target
Name:
Voltage-dependent T-type calcium channel subunit alpha-1H
Synonyms:
CAC1H_HUMAN Low-voltage-activated calcium channel alpha1 3.2 subunit Voltage-gated calcium channel voltage-dependent T-type calcium channel subunit alpha-1H isoform a
Type:
Enzyme Catalytic Domain
Mol. Mass.:
259187.68
Organism:
Homo sapiens (Human)
Description:
Calcium channel (Type T,L) 0 0::O95180
Residue:
2353
  
Inhibitor
Name:
BDBM76864
Synonyms:
1-[(2,4-dichlorophenyl)methyl]-N-(2-furanylmethyl)-4-pyrazolo[3,4-d]pyrimidinamine MLS000037889 [1-(2,4-dichlorobenzyl)pyrazolo[3,4-d]pyrimidin-4-yl]-(2-furfuryl)amine | cid_657901
Type:
Small organic molecule
Emp. Form.:
C17H13Cl2N5O
Mol. Mass.:
374.224
SMILES:
Clc1ccc(Cn2ncc3c(NCc4ccco4)ncnc23)c(Cl)c1
: