Target
Voltage-dependent T-type calcium channel subunit alpha-1H
Ligand
BDBM78493
Substrate
Meas. Tech.
Inhibitors of T-Type Calcium Channels (SynthLib2)
EC50
10000±n/a nM
Citation
 PubChem, PC Inhibitors of T-Type Calcium Channels (SynthLib2) PubChem Bioassay (2011)[AID] 
Target
Name:
Voltage-dependent T-type calcium channel subunit alpha-1H
Synonyms:
CAC1H_HUMAN Low-voltage-activated calcium channel alpha1 3.2 subunit Voltage-gated calcium channel voltage-dependent T-type calcium channel subunit alpha-1H isoform a
Type:
Enzyme Catalytic Domain
Mol. Mass.:
259187.68
Organism:
Homo sapiens (Human)
Description:
Calcium channel (Type T,L) 0 0::O95180
Residue:
2353
  
Inhibitor
Name:
BDBM78493
Synonyms:
2-(2-chloranylphenoxy)-N-[(3S)-1-(phenylmethyl)piperidin-3-yl]ethanamide N-[(3S)-1-benzyl-3-piperidyl]-2-(2-chlorophenoxy)acetamide VU0414822-1 | cid_45115599
Type:
Small organic molecule
Emp. Form.:
C20H23ClN2O2
Mol. Mass.:
358.862
SMILES:
Clc1ccccc1OCC(=O)N[C@H]1CCCN(Cc2ccccc2)C1
: