Target
Voltage-dependent T-type calcium channel subunit alpha-1H
Ligand
BDBM78498
Substrate
Meas. Tech.
Inhibitors of T-Type Calcium Channels (SynthLib2)
EC50
10000±n/a nM
Citation
 PubChem, PC Inhibitors of T-Type Calcium Channels (SynthLib2) PubChem Bioassay (2011)[AID] 
Target
Name:
Voltage-dependent T-type calcium channel subunit alpha-1H
Synonyms:
CAC1H_HUMAN Low-voltage-activated calcium channel alpha1 3.2 subunit Voltage-gated calcium channel voltage-dependent T-type calcium channel subunit alpha-1H isoform a
Type:
Enzyme Catalytic Domain
Mol. Mass.:
259187.68
Organism:
Homo sapiens (Human)
Description:
Calcium channel (Type T,L) 0 0::O95180
Residue:
2353
  
Inhibitor
Name:
BDBM78498
Synonyms:
2-(3-chloranyl-4-fluoranyl-phenoxy)-N-[(3R)-1-(phenylmethyl)piperidin-3-yl]ethanamide N-[(3R)-1-benzyl-3-piperidyl]-2-(3-chloro-4-fluoro-phenoxy)acetamide VU0414827-1 | cid_45115603
Type:
Small organic molecule
Emp. Form.:
C20H22ClFN2O2
Mol. Mass.:
376.852
SMILES:
Fc1ccc(OCC(=O)N[C@@H]2CCCN(Cc3ccccc3)C2)cc1Cl
: