Target
Ubiquitin-conjugating enzyme E2 N
Ligand
BDBM79177
Substrate
Meas. Tech.
Dose Response confirmation of uHTS for the identification of UBC13 Polyubiquitin Inhibitors via a TR-FRET Assay
IC50
2471±194 nM
Citation
 PubChem, PC Dose Response confirmation of uHTS for the identification of UBC13 Polyubiquitin Inhibitors via a TR-FRET Assay PubChem Bioassay (2011)[AID] 
Target
Name:
Ubiquitin-conjugating enzyme E2 N
Synonyms:
BLU UBE2N_HUMAN | ubiquitin-conjugating enzyme E2 N
Type:
PROTEIN
Mol. Mass.:
17137.61
Organism:
Homo sapiens (Human)
Description:
EBI_101440
Residue:
152
  
Inhibitor
Name:
BDBM79177
Synonyms:
IK-IW SMR000391074 | cid_25102366
Type:
Small organic molecule
Emp. Form.:
C51H79ClN18O5
Mol. Mass.:
1059.744
SMILES:
Cl.CCC(C)[C@H](N)c1cn(nn1)[C@@H](CCCCN)C(=O)N1CCN(CC1)c1nc(NCCOCCOCCOCC#C)nc(n1)N1CCN(CC1)C(=O)[C@H](Cc1cc2ccccc2[nH]1)n1cc(nn1)[C@@H](N)C(C)CC
: