Target
Ubiquitin-conjugating enzyme E2 N
Ligand
BDBM79188
Substrate
Meas. Tech.
Dose Response confirmation of uHTS for the identification of UBC13 Polyubiquitin Inhibitors via a TR-FRET Assay
IC50
2734±134 nM
Citation
 PubChem, PC Dose Response confirmation of uHTS for the identification of UBC13 Polyubiquitin Inhibitors via a TR-FRET Assay PubChem Bioassay (2011)[AID] 
Target
Name:
Ubiquitin-conjugating enzyme E2 N
Synonyms:
BLU UBE2N_HUMAN | ubiquitin-conjugating enzyme E2 N
Type:
PROTEIN
Mol. Mass.:
17137.61
Organism:
Homo sapiens (Human)
Description:
EBI_101440
Residue:
152
  
Inhibitor
Name:
BDBM79188
Synonyms:
KG-RI SMR001231150 | cid_24978599
Type:
Small organic molecule
Emp. Form.:
C64H112N20O7
Mol. Mass.:
1273.7039
SMILES:
[#6]-[#6]-[#6@H](-[#6])-[#6@@H](-[#6](=O)-[#7]-[#6]-[#6]-[#6]-[#6]-[#6]-[#6]-[#6]-[#6]-[#6]-[#6]-[#6](=O)-[#7]-1-[#6]-[#6]-[#7](-[#6]-[#6]-1)-c1nc(-[#7]-[#6]-[#6]-[#8]-[#6]-[#6]-[#8]-[#6]-[#6]-[#8]-[#6]C#C)nc(n1)-[#7]-1-[#6]-[#6]-[#7](-[#6]-[#6]-1)-[#6](=O)-[#6]-[#6]-[#6]-[#6]-[#6]-[#6]-[#6]-[#6]-[#6]-[#6]-[#7]-[#6](=O)-[#6]-n1cc(-[#6]-[#6]-[#6]-[#6]-[#6]-[#7])nn1)-n1cc(-[#6]-[#6]-[#6]-[#6]\[#7]=[#6](\[#7])-[#7])nn1
: