Target
Ubiquitin-conjugating enzyme E2 N
Ligand
BDBM79120
Substrate
Meas. Tech.
Dose Response confirmation of uHTS for the identification of UBC13 Polyubiquitin Inhibitors via a TR-FRET Assay reconfirm
IC50
2178±56 nM
Citation
 PubChem, PC Dose Response confirmation of uHTS for the identification of UBC13 Polyubiquitin Inhibitors via a TR-FRET Assay reconfirm PubChem Bioassay (2011)[AID] 
Target
Name:
Ubiquitin-conjugating enzyme E2 N
Synonyms:
BLU UBE2N_HUMAN | ubiquitin-conjugating enzyme E2 N
Type:
PROTEIN
Mol. Mass.:
17137.61
Organism:
Homo sapiens (Human)
Description:
EBI_101440
Residue:
152
  
Inhibitor
Name:
BDBM79120
Synonyms:
MLS001158325 N'-(3-carbamoyl-5,5-dimethyl-4,7-dihydrothieno[2,3-c]pyran-2-yl)-N-(2-oxolanylmethyl)oxamide N'-(3-carbamoyl-5,5-dimethyl-4,7-dihydrothieno[2,3-c]pyran-2-yl)-N-(tetrahydrofurfuryl)oxamide cid_17584097
Type:
Small organic molecule
Emp. Form.:
C17H23N3O5S
Mol. Mass.:
381.447
SMILES:
CC1(C)Cc2c(CO1)sc(NC(=O)C(=O)NCC1CCCO1)c2C(N)=O
: