Target
Perilipin-5
Ligand
BDBM29143
Substrate
Meas. Tech.
Luminescence-based biochemical high throughput dose response assay for inhibitors of the interaction of the lipase co-activator protein, abhydrolase domain
IC50
4245±n/a nM
Citation
 PubChem, PC Luminescence-based biochemical high throughput dose response assay for inhibitors of the interaction of the lipase co-activator protein, abhydrolase domain containing 5 (ABHD5) with perilipin-5 (MLDP; PLIN5) (2K validation set) PubChem Bioassay (2011)[AID] 
Target
Name:
Perilipin-5
Synonyms:
LSDP5 PAT-1 PLIN5_HUMAN
Type:
Enzyme Catalytic Domain
Mol. Mass.:
50774.20
Organism:
Homo sapiens (Human)
Description:
gi_116292172
Residue:
463
  
Inhibitor
Name:
BDBM29143
Synonyms:
CHEMBL7976 Chalcone, 13 substituted chalcone, 5j
Type:
Small organic molecule
Emp. Form.:
C15H12O
Mol. Mass.:
208.2552
SMILES:
O=C(\C=C\c1ccccc1)c1ccccc1
: