Target
Caspase-3
Ligand
BDBM63310
Substrate
Meas. Tech.
Dose response counterscreen for dual activators of procaspase-3 and procaspase-7: Absorbance-based biochemical high throughput screening assay to identify activators of procaspase-3
EC50
>85266±n/a nM
Citation
 PubChem, PC Dose response counterscreen for dual activators of procaspase-3 and procaspase-7: Absorbance-based biochemical high throughput screening assay to identify activators of procaspase-3 PubChem Bioassay (2011)[AID] 
Target
Name:
Caspase-3
Synonyms:
Apopain CASP3 CPP-32 Caspase 3 Caspase-3 subunit p17 SCA-1 Yama protein | caspase-3 preproprotein
Type:
Hydrolase; heterotetramer of two heterodimers
Mol. Mass.:
31607.55
Organism:
Homo sapiens (Human)
Description:
Residue:
277
  
Inhibitor
Name:
BDBM63310
Synonyms:
MLS000418008 N-(2,3-dihydro-1,4-benzodioxin-6-yl)-4-oxidanylidene-chromene-3-carboxamide N-(2,3-dihydro-1,4-benzodioxin-6-yl)-4-oxochromene-3-carboxamide cid_2395074
Type:
Small organic molecule
Emp. Form.:
C18H13NO5
Mol. Mass.:
323.2995
SMILES:
O=C(Nc1ccc2OCCOc2c1)c1coc2ccccc2c1=O
: