Target
Alpha-2C adrenergic receptor
Ligand
BDBM42323
Substrate
Meas. Tech.
Late-stage radioligand binding dose response assay to identify inhibitors of NADPH oxidase 1 (NOX1): PDSP screen Ki Set 2
Ki
>10000±n/a nM
Citation
 PubChem, PC Late-stage radioligand binding dose response assay to identify inhibitors of NADPH oxidase 1 (NOX1): PDSP screen Ki Set 2 PubChem Bioassay (2011)[AID] 
Target
Name:
Alpha-2C adrenergic receptor
Synonyms:
ADA2C_HUMAN ADRA2L2 Adrenergic alpha2C Adrenergic receptor alpha Alpha-2 adrenergic receptor subtype C4 Alpha-2C adrenoreceptor | adrenergic, alpha-2C-, receptor [Homo sapiens]
Type:
Enzyme
Mol. Mass.:
49552.32
Organism:
Homo sapiens (Human)
Description:
P18825
Residue:
462
  
Inhibitor
Name:
BDBM42323
Synonyms:
1-(10H-phenothiazin-2-yl)ethanone SMR000033635 | cid_81131
Type:
Small organic molecule
Emp. Form.:
C14H11NOS
Mol. Mass.:
241.308
SMILES:
CC(=O)c1ccc2Sc3ccccc3Nc2c1
: