Target
Peroxisome proliferator-activated receptor gamma
Ligand
BDBM79451
Substrate
Meas. Tech.
Luminescence-based cell-based assay provider high throughput dose response assay for partial agonists of the peroxisome proliferator-activated receptor gamma (PPARg)
EC50
7600±n/a nM
Citation
 PubChem, PC Luminescence-based cell-based assay provider high throughput dose response assay for partial agonists of the peroxisome proliferator-activated receptor gamma (PPARg) PubChem Bioassay (2011)[AID] 
Target
Name:
Peroxisome proliferator-activated receptor gamma
Synonyms:
NR1C3 PPAR-gamma PPARG_HUMAN Peroxisome proliferator-activated receptor gamma (PPAR gamma) Peroxisome proliferator-activated receptor gamma (PPARĪ³) peroxisome proliferator-activated receptor gamma isoform 2
Type:
Nuclear Receptor
Mol. Mass.:
57613.46
Organism:
Homo sapiens (Human)
Description:
P37231
Residue:
505
  
Inhibitor
Name:
BDBM79451
Synonyms:
4-(1H-benzimidazol-2-ylthio)-7-(4-methylpiperazino)sulfonyl-piazthiole 7-(1H-benzimidazol-2-ylthio)-4-[(4-methyl-1-piperazinyl)sulfonyl]-2,1,3-benzothiadiazole SR-01000298724-2 | cid_2236395
Type:
Small organic molecule
Emp. Form.:
C18H18N6O2S3
Mol. Mass.:
446.57
SMILES:
CN1CCN(CC1)S(=O)(=O)c1ccc(Sc2nc3ccccc3[nH]2)c2nsnc12
: