Target
Peroxisome proliferator-activated receptor gamma
Ligand
BDBM63698
Substrate
Meas. Tech.
Luminescence-based cell-based assay provider high throughput dose response assay for partial agonists of the peroxisome proliferator-activated receptor gamma (PPARg)
EC50
15000±n/a nM
Citation
 PubChem, PC Luminescence-based cell-based assay provider high throughput dose response assay for partial agonists of the peroxisome proliferator-activated receptor gamma (PPARg) PubChem Bioassay (2011)[AID] 
Target
Name:
Peroxisome proliferator-activated receptor gamma
Synonyms:
NR1C3 PPAR-gamma PPARG_HUMAN Peroxisome proliferator-activated receptor gamma (PPAR gamma) Peroxisome proliferator-activated receptor gamma (PPARĪ³) peroxisome proliferator-activated receptor gamma isoform 2
Type:
Nuclear Receptor
Mol. Mass.:
57613.46
Organism:
Homo sapiens (Human)
Description:
P37231
Residue:
505
  
Inhibitor
Name:
BDBM63698
Synonyms:
1-[2-[1-(2,3-dihydro-1,4-benzodioxin-6-yl)-2,5-dimethyl-3-pyrrolyl]-2-oxoethyl]-3-(phenylmethyl)imidazolidine-2,4,5-trione 1-benzyl-3-[2-[1-(2,3-dihydro-1,4-benzodioxin-6-yl)-2,5-dimethyl-pyrrol-3-yl]-2-keto-ethyl]imidazolidine-2,4,5-trione MLS000516747 cid_2495457
Type:
Small organic molecule
Emp. Form.:
C26H23N3O6
Mol. Mass.:
473.4773
SMILES:
Cc1cc(C(=O)CN2C(=O)N(Cc3ccccc3)C(=O)C2=O)c(C)n1-c1ccc2OCCOc2c1
: