Target
Peroxisome proliferator-activated receptor gamma
Ligand
BDBM79458
Substrate
Meas. Tech.
Luminescence-based cell-based assay provider high throughput dose response assay for partial agonists of the peroxisome proliferator-activated receptor gamma (PPARg)
EC50
2600±n/a nM
Citation
 PubChem, PC Luminescence-based cell-based assay provider high throughput dose response assay for partial agonists of the peroxisome proliferator-activated receptor gamma (PPARg) PubChem Bioassay (2011)[AID] 
Target
Name:
Peroxisome proliferator-activated receptor gamma
Synonyms:
NR1C3 PPAR-gamma PPARG_HUMAN Peroxisome proliferator-activated receptor gamma (PPAR gamma) Peroxisome proliferator-activated receptor gamma (PPARĪ³) peroxisome proliferator-activated receptor gamma isoform 2
Type:
Nuclear Receptor
Mol. Mass.:
57613.46
Organism:
Homo sapiens (Human)
Description:
P37231
Residue:
505
  
Inhibitor
Name:
BDBM79458
Synonyms:
3-[(5E)-5-(3-ethoxybenzylidene)-4-keto-2-thioxo-thiazolidin-3-yl]propionic acid 3-[(5E)-5-[(3-ethoxyphenyl)methylidene]-4-oxo-2-sulfanylidene-1,3-thiazolidin-3-yl]propanoic acid SR-01000261582 cid_1306590
Type:
Small organic molecule
Emp. Form.:
C15H15NO4S2
Mol. Mass.:
337.414
SMILES:
CCOc1cccc(\C=C2\SC(=S)N(CCC(O)=O)C2=O)c1
: