Target
Sphingosine 1-phosphate receptor 4
Ligand
BDBM79463
Substrate
Meas. Tech.
Late-stage fluorescence dose response cell-based assay to identify agonists of the Sphingosine 1-Phosphate Receptor 4 (S1P4): purchased compounds EC50
EC50
>50000±n/a nM
Citation
 PubChem, PC Late-stage fluorescence dose response cell-based assay to identify agonists of the Sphingosine 1-Phosphate Receptor 4 (S1P4): purchased compounds EC50 PubChem Bioassay (2011)[AID] 
Target
Name:
Sphingosine 1-phosphate receptor 4
Synonyms:
EDG6 S1P receptor 4 S1P4 S1PR4_HUMAN Sphingosine 1-phosphate receptor Edg-6 sphingosine-1-phosphate 4 S1P4
Type:
G Protein-Coupled Receptor (GPCR)
Mol. Mass.:
41647.39
Organism:
Homo sapiens (Human)
Description:
Residue:
384
  
Inhibitor
Name:
BDBM79463
Synonyms:
3-[2-(4-methoxyphenoxy)ethoxy]-6-methyl-2-nitro-pyridine SR-01000708797 cid_4817566
Type:
Small organic molecule
Emp. Form.:
C15H16N2O5
Mol. Mass.:
304.2979
SMILES:
COc1ccc(OCCOc2ccc(C)nc2[N+]([O-])=O)cc1
: