Target
Sphingosine 1-phosphate receptor 4
Ligand
BDBM79488
Substrate
Meas. Tech.
Late-stage fluorescence dose response cell-based assay to identify agonists of the Sphingosine 1-Phosphate Receptor 4 (S1P4): purchased compounds EC50
EC50
>50000±n/a nM
Citation
 PubChem, PC Late-stage fluorescence dose response cell-based assay to identify agonists of the Sphingosine 1-Phosphate Receptor 4 (S1P4): purchased compounds EC50 PubChem Bioassay (2011)[AID] 
Target
Name:
Sphingosine 1-phosphate receptor 4
Synonyms:
EDG6 S1P receptor 4 S1P4 S1PR4_HUMAN Sphingosine 1-phosphate receptor Edg-6 sphingosine-1-phosphate 4 S1P4
Type:
G Protein-Coupled Receptor (GPCR)
Mol. Mass.:
41647.39
Organism:
Homo sapiens (Human)
Description:
Residue:
384
  
Inhibitor
Name:
BDBM79488
Synonyms:
N-[2-(4-chloranylphenoxy)ethyl]-N-methyl-2-(6-methyl-2-nitro-pyridin-3-yl)oxy-ethanamide N-[2-(4-chlorophenoxy)ethyl]-N-methyl-2-[(6-methyl-2-nitro-3-pyridinyl)oxy]acetamide SR-02000000329 cid_40681428
Type:
Small organic molecule
Emp. Form.:
C17H18ClN3O5
Mol. Mass.:
379.795
SMILES:
CN(CCOc1ccc(Cl)cc1)C(=O)COc1ccc(C)nc1[N+]([O-])=O
: