Target
Mitochondrial import inner membrane translocase subunit TIM23
Ligand
BDBM78045
Substrate
Meas. Tech.
Dose Response confirmation of uHTS small molecule inhibitors of tim10-1: a luminescent tim23-1 yeast counterscreen.
IC50
3860±n/a nM
Citation
 PubChem, PC Dose Response confirmation of uHTS small molecule inhibitors of tim10-1: a luminescent tim23-1 yeast counterscreen. PubChem Bioassay (2011)[AID] 
Target
Name:
Mitochondrial import inner membrane translocase subunit TIM23
Synonyms:
MAS6 MPI3 TIM23_YEAST | TPA: Essential component of the Translocase of the Inner Mitochondrial membrane (TIM23 complex)
Type:
Enzyme Catalytic Domain
Mol. Mass.:
23245.32
Organism:
Saccharomyces cerevisiae S288c
Description:
gi_285814664
Residue:
222
  
Inhibitor
Name:
BDBM78045
Synonyms:
3-(4-methoxyphenyl)-1,2,4,5-tetrazine SMR000113807 methyl 4-(1,2,4,5-tetraazin-3-yl)phenyl ether
Type:
Small organic molecule
Emp. Form.:
C9H8N4O
Mol. Mass.:
188.186
SMILES:
COc1ccc(cc1)-c1nncnn1
: