Target
Neurotensin receptor type 1
Ligand
BDBM79516
Substrate
Meas. Tech.
Dose Response confirmation of Image-Based HTS for Selective Agonists for NTR1
EC50
9820±n/a nM
Citation
 PubChem, PC Dose Response confirmation of Image-Based HTS for Selective Agonists for NTR1 PubChem Bioassay (2011)[AID] 
Target
Name:
Neurotensin receptor type 1
Synonyms:
Dopamine receptor D2L/neurotensin receptor NTS1 NTRR Neurotensin receptor 1 | neurotensin receptor type 1
Type:
PROTEIN
Mol. Mass.:
46278.89
Organism:
Homo sapiens (Human)
Description:
ChEMBL_1453811
Residue:
418
  
Inhibitor
Name:
BDBM79516
Synonyms:
1-(2,4-dimethylphenyl)-4-(4-phenyl-1-piperazinyl)pyrazolo[3,4-d]pyrimidine 1-(2,4-dimethylphenyl)-4-(4-phenylpiperazino)pyrazolo[3,4-d]pyrimidine SMR000035301 | cid_661231
Type:
Small organic molecule
Emp. Form.:
C23H24N6
Mol. Mass.:
384.4769
SMILES:
Cc1ccc(c(C)c1)-n1ncc2c(ncnc12)N1CCN(CC1)c1ccccc1
: