Target
Neurotensin receptor type 1
Ligand
BDBM72121
Substrate
Meas. Tech.
Dose Response confirmation of Image-Based HTS for Selective Agonists for NTR1
EC50
33900±n/a nM
Citation
 PubChem, PC Dose Response confirmation of Image-Based HTS for Selective Agonists for NTR1 PubChem Bioassay (2011)[AID] 
Target
Name:
Neurotensin receptor type 1
Synonyms:
Dopamine receptor D2L/neurotensin receptor NTS1 NTRR Neurotensin receptor 1 | neurotensin receptor type 1
Type:
PROTEIN
Mol. Mass.:
46278.89
Organism:
Homo sapiens (Human)
Description:
ChEMBL_1453811
Residue:
418
  
Inhibitor
Name:
BDBM72121
Synonyms:
2-[(1,3-diphenyl-1H-pyrazol-4-yl)methylene]-5,5-dimethyl-1,3-cyclohexanedione 2-[(1,3-diphenylpyrazol-4-yl)methylene]-5,5-dimethyl-cyclohexane-1,3-quinone 2-[(1,3-diphenylpyrazol-4-yl)methylidene]-5,5-dimethylcyclohexane-1,3-dione SMR000186140 | cid_1181160
Type:
Small organic molecule
Emp. Form.:
C24H22N2O2
Mol. Mass.:
370.4437
SMILES:
[#6]C1([#6])[#6]-[#6](=O)\[#6](=[#6]/c2cn(nc2-c2ccccc2)-c2ccccc2)-[#6](=O)-[#6]1
: