Target
Neurotensin receptor type 1
Ligand
BDBM41685
Substrate
Meas. Tech.
Dose Response confirmation of Image-Based HTS for Selective Agonists for NTR1
EC50
25000±n/a nM
Citation
 PubChem, PC Dose Response confirmation of Image-Based HTS for Selective Agonists for NTR1 PubChem Bioassay (2011)[AID] 
Target
Name:
Neurotensin receptor type 1
Synonyms:
Dopamine receptor D2L/neurotensin receptor NTS1 NTRR Neurotensin receptor 1 | neurotensin receptor type 1
Type:
PROTEIN
Mol. Mass.:
46278.89
Organism:
Homo sapiens (Human)
Description:
ChEMBL_1453811
Residue:
418
  
Inhibitor
Name:
BDBM41685
Synonyms:
4-[3-(4-bromophenyl)-5-(4-fluorophenyl)-2-pyrazolin-1-yl]benzenesulfonamide 4-[5-(4-bromophenyl)-3-(4-fluorophenyl)-3,4-dihydropyrazol-2-yl]benzenesulfonamide SMR000186920 | cid_2864688
Type:
Small organic molecule
Emp. Form.:
C21H17BrFN3O2S
Mol. Mass.:
474.346
SMILES:
NS(=O)(=O)c1ccc(cc1)N1N=C(CC1c1ccc(F)cc1)c1ccc(Br)cc1
: