Target
Neurotensin receptor type 1
Ligand
BDBM47857
Substrate
Meas. Tech.
Dose Response confirmation of Image-Based HTS for Selective Agonists for NTR1
EC50
15900±n/a nM
Citation
 PubChem, PC Dose Response confirmation of Image-Based HTS for Selective Agonists for NTR1 PubChem Bioassay (2011)[AID] 
Target
Name:
Neurotensin receptor type 1
Synonyms:
Dopamine receptor D2L/neurotensin receptor NTS1 NTRR Neurotensin receptor 1 | neurotensin receptor type 1
Type:
PROTEIN
Mol. Mass.:
46278.89
Organism:
Homo sapiens (Human)
Description:
ChEMBL_1453811
Residue:
418
  
Inhibitor
Name:
BDBM47857
Synonyms:
2-furancarboxylic acid [4-bromo-2-[(E)-3-(2-fluorophenyl)-1-oxoprop-2-enyl]phenyl] ester MLS000575348 [4-bromanyl-2-[(E)-3-(2-fluorophenyl)prop-2-enoyl]phenyl] furan-2-carboxylate cid_5734448 | furan-2-carboxylic acid [4-bromo-2-[(E)-3-(2-fluorophenyl)acryloyl]phenyl] ester
Type:
Small organic molecule
Emp. Form.:
C20H12BrFO4
Mol. Mass.:
415.209
SMILES:
Fc1ccccc1\C=C\C(=O)c1cc(Br)ccc1OC(=O)c1ccco1
: