Target
Neurotensin receptor type 1
Ligand
BDBM79551
Substrate
Meas. Tech.
Dose Response confirmation of Image-Based HTS for Selective Agonists for NTR1
EC50
12000±n/a nM
Citation
 PubChem, PC Dose Response confirmation of Image-Based HTS for Selective Agonists for NTR1 PubChem Bioassay (2011)[AID] 
Target
Name:
Neurotensin receptor type 1
Synonyms:
Dopamine receptor D2L/neurotensin receptor NTS1 NTRR Neurotensin receptor 1 | neurotensin receptor type 1
Type:
PROTEIN
Mol. Mass.:
46278.89
Organism:
Homo sapiens (Human)
Description:
ChEMBL_1453811
Residue:
418
  
Inhibitor
Name:
BDBM79551
Synonyms:
2-fluorobenzoic acid [2-[(Z)-3-(2-benzofuranyl)-3-oxoprop-1-enyl]phenyl] ester MLS000389185 [2-[(Z)-3-(1-benzofuran-2-yl)-3-oxidanylidene-prop-1-enyl]phenyl] 2-fluoranylbenzoate cid_15945158
Type:
Small organic molecule
Emp. Form.:
C24H15FO4
Mol. Mass.:
386.3719
SMILES:
Fc1ccccc1C(=O)Oc1ccccc1\C=C/C(=O)c1cc2ccccc2o1
: