Target
Neurotensin receptor type 1
Ligand
BDBM50480
Substrate
Meas. Tech.
Dose Response confirmation of Image-Based HTS for Selective Agonists for NTR1
EC50
>40000±n/a nM
Citation
 PubChem, PC Dose Response confirmation of Image-Based HTS for Selective Agonists for NTR1 PubChem Bioassay (2011)[AID] 
Target
Name:
Neurotensin receptor type 1
Synonyms:
Dopamine receptor D2L/neurotensin receptor NTS1 NTRR Neurotensin receptor 1 | neurotensin receptor type 1
Type:
PROTEIN
Mol. Mass.:
46278.89
Organism:
Homo sapiens (Human)
Description:
ChEMBL_1453811
Residue:
418
  
Inhibitor
Name:
BDBM50480
Synonyms:
1-(4-morpholin-4-yl-2,1,3-benzoxadiazol-7-yl)-3-(4-nitrophenyl)urea 1-[4-(4-morpholinyl)-2,1,3-benzoxadiazol-7-yl]-3-(4-nitrophenyl)urea N-[7-(4-morpholinyl)-2,1,3-benzoxadiazol-4-yl]-N'-(4-nitrophenyl)urea cid_2955071
Type:
Small organic molecule
Emp. Form.:
C17H16N6O5
Mol. Mass.:
384.3461
SMILES:
[O-][N+](=O)c1ccc(NC(=O)Nc2ccc(N3CCOCC3)c3nonc23)cc1
: