Target
Neurotensin receptor type 1
Ligand
BDBM61115
Substrate
Meas. Tech.
Dose Response confirmation of Image-Based HTS for Selective Agonists for NTR1
EC50
16000±n/a nM
Citation
 PubChem, PC Dose Response confirmation of Image-Based HTS for Selective Agonists for NTR1 PubChem Bioassay (2011)[AID] 
Target
Name:
Neurotensin receptor type 1
Synonyms:
Dopamine receptor D2L/neurotensin receptor NTS1 NTRR Neurotensin receptor 1 | neurotensin receptor type 1
Type:
PROTEIN
Mol. Mass.:
46278.89
Organism:
Homo sapiens (Human)
Description:
ChEMBL_1453811
Residue:
418
  
Inhibitor
Name:
BDBM61115
Synonyms:
3-phenyl-1,4-benzodioxin-2-carbaldehyde 3-phenyl-1,4-benzodioxine-2-carbaldehyde SMR000495839 | cid_677881
Type:
Small organic molecule
Emp. Form.:
C15H10O3
Mol. Mass.:
238.2381
SMILES:
O=CC1=C(Oc2ccccc2O1)c1ccccc1
: