Target
Neurotensin receptor type 1
Ligand
BDBM36973
Substrate
Meas. Tech.
Dose Response confirmation of Image-Based HTS for Selective Agonists for NTR1
EC50
8730±n/a nM
Citation
 PubChem, PC Dose Response confirmation of Image-Based HTS for Selective Agonists for NTR1 PubChem Bioassay (2011)[AID] 
Target
Name:
Neurotensin receptor type 1
Synonyms:
Dopamine receptor D2L/neurotensin receptor NTS1 NTRR Neurotensin receptor 1 | neurotensin receptor type 1
Type:
PROTEIN
Mol. Mass.:
46278.89
Organism:
Homo sapiens (Human)
Description:
ChEMBL_1453811
Residue:
418
  
Inhibitor
Name:
BDBM36973
Synonyms:
1-[[5-[5-(4-methylphenyl)thieno[2,3-d]pyrimidin-4-yl]sulfanyl-1,3,4-oxadiazol-2-yl]methyl]azepan-2-one 1-[[5-[[5-(p-tolyl)thieno[2,3-d]pyrimidin-4-yl]thio]-1,3,4-oxadiazol-2-yl]methyl]azepan-2-one SMR000064688 | cid_2538553
Type:
Small organic molecule
Emp. Form.:
C22H21N5O2S2
Mol. Mass.:
451.564
SMILES:
Cc1ccc(cc1)-c1csc2ncnc(Sc3nnc(CN4CCCCCC4=O)o3)c12
: