Target
Protein Mdm4
Ligand
BDBM70514
Substrate
Meas. Tech.
Dose Response confirmation of Inhibitors of Mdm2/MdmX interaction in luminescent format
IC50
6190±n/a nM
Citation
 PubChem, PC Dose Response confirmation of Inhibitors of Mdm2/MdmX interaction in luminescent format PubChem Bioassay (2011)[AID] 
Target
Name:
Protein Mdm4
Synonyms:
Double minute 4 protein MDM2-MDMX MDM4_HUMAN Mdm2-like p53-binding protein Protein Mdmx p53-binding protein | p53-binding protein Mdm4
Type:
Oncoprotein
Mol. Mass.:
54842.04
Organism:
Homo sapiens (Human)
Description:
The HDMX(1-188) were expressed in Escherichia coli BL21 (DE3) as a GST fusion and purified on glutathione sepharose.
Residue:
490
  
Inhibitor
Name:
BDBM70514
Synonyms:
2-[(1-methyl-3-nitro-1H-1,2,4-triazol-5-yl)thio]-5-phenyl-1,3,4-oxadiazole 2-[(2-methyl-5-nitro-1,2,4-triazol-3-yl)thio]-5-phenyl-1,3,4-oxadiazole SMR000142674 | cid_890456
Type:
Small organic molecule
Emp. Form.:
C11H8N6O3S
Mol. Mass.:
304.285
SMILES:
Cn1nc(nc1Sc1nnc(o1)-c1ccccc1)[N+]([O-])=O
: