Target
Mitochondrial import inner membrane translocase subunit TIM10
Ligand
BDBM77767
Substrate
Meas. Tech.
Dose Response confirmation of uHTS small molecule inhibitors of tim23-1: a luminescent tim10-1 yeast counterscreen.
IC50
>100000±n/a nM
Citation
 PubChem, PC Dose Response confirmation of uHTS small molecule inhibitors of tim23-1: a luminescent tim10-1 yeast counterscreen. PubChem Bioassay (2011)[AID] 
Target
Name:
Mitochondrial import inner membrane translocase subunit TIM10
Synonyms:
MRS11 TIM10_YEAST TPA: Essential protein of the mitochondrial intermembrane space, forms a complex with Tim9p (TIM10 complex) that delivers hydrophobic proteins to the TIM22 complex for insertion into the inner ...
Type:
Enzyme Catalytic Domain
Mol. Mass.:
10303.50
Organism:
Saccharomyces cerevisiae S288c
Description:
gi_285809906
Residue:
93
  
Inhibitor
Name:
BDBM77767
Synonyms:
MLS000723710 N-[[(Z)-3-(2-furanyl)prop-2-enylidene]amino]-2-thiophenecarboxamide N-[[(Z)-3-(furan-2-yl)prop-2-enylidene]amino]thiophene-2-carboxamide cid_1584401
Type:
Small organic molecule
Emp. Form.:
C12H10N2O2S
Mol. Mass.:
246.285
SMILES:
O=C(NN=C\C=C/c1ccco1)c1cccs1
: