Target
Mitochondrial import inner membrane translocase subunit TIM10
Ligand
BDBM39524
Substrate
Meas. Tech.
Dose Response confirmation of uHTS small molecule inhibitors of tim23-1: a luminescent TIM10 yeast counterscreen.
IC50
12700±n/a nM
Citation
 PubChem, PC Dose Response confirmation of uHTS small molecule inhibitors of tim23-1: a luminescent TIM10 yeast counterscreen. PubChem Bioassay (2011)[AID] 
Target
Name:
Mitochondrial import inner membrane translocase subunit TIM10
Synonyms:
MRS11 TIM10_YEAST TPA: Essential protein of the mitochondrial intermembrane space, forms a complex with Tim9p (TIM10 complex) that delivers hydrophobic proteins to the TIM22 complex for insertion into the inner ...
Type:
Enzyme Catalytic Domain
Mol. Mass.:
10303.50
Organism:
Saccharomyces cerevisiae S288c
Description:
gi_285809906
Residue:
93
  
Inhibitor
Name:
BDBM39524
Synonyms:
(10H-Phenothiazin-2-yl)-carbamic acid ethyl ester N-(10H-phenothiazin-2-yl)carbamic acid ethyl ester cid_652628 | ethyl N-(10H-phenothiazin-2-yl)carbamate
Type:
Small organic molecule
Emp. Form.:
C15H14N2O2S
Mol. Mass.:
286.349
SMILES:
CCOC(=O)Nc1ccc2Sc3ccccc3Nc2c1
: