Target
Mitochondrial import inner membrane translocase subunit TIM10
Ligand
BDBM38118
Substrate
Meas. Tech.
Dose Response confirmation of uHTS small molecule inhibitors of tim23-1: a luminescent TIM10 yeast counterscreen.
IC50
42400±n/a nM
Citation
 PubChem, PC Dose Response confirmation of uHTS small molecule inhibitors of tim23-1: a luminescent TIM10 yeast counterscreen. PubChem Bioassay (2011)[AID] 
Target
Name:
Mitochondrial import inner membrane translocase subunit TIM10
Synonyms:
MRS11 TIM10_YEAST TPA: Essential protein of the mitochondrial intermembrane space, forms a complex with Tim9p (TIM10 complex) that delivers hydrophobic proteins to the TIM22 complex for insertion into the inner ...
Type:
Enzyme Catalytic Domain
Mol. Mass.:
10303.50
Organism:
Saccharomyces cerevisiae S288c
Description:
gi_285809906
Residue:
93
  
Inhibitor
Name:
BDBM38118
Synonyms:
2-[(4-ketopyrido[1,2-a]pyrimidin-2-yl)methylthio]nicotinic acid isopropyl ester MLS000096036 cid_3240387 propan-2-yl 2-[(4-oxidanylidenepyrido[1,2-a]pyrimidin-2-yl)methylsulfanyl]pyridine-3-carboxylate | propan-2-yl 2-[(4-oxopyrido[1,2-a]pyrimidin-2-yl)methylsulfanyl]pyridine-3-carboxylate
Type:
Small organic molecule
Emp. Form.:
C18H17N3O3S
Mol. Mass.:
355.411
SMILES:
CC(C)OC(=O)c1cccnc1SCc1cc(=O)n2ccccc2n1
: