Target
Bcl-2-related protein A1
Ligand
BDBM79262
Substrate
Meas. Tech.
Dose Response confirmation of UBC13 Polyubiquitin Inhibitors using a Bfl-1 counterscreen
IC50
11800±352 nM
Citation
 PubChem, PC Dose Response confirmation of UBC13 Polyubiquitin Inhibitors using a Bfl-1 counterscreen PubChem Bioassay (2011)[AID] 
Target
Name:
Bcl-2-related protein A1
Synonyms:
A1 B-cell leukemia/lymphoma 2 related protein A1a Bcl2a1 Bfl-1 Hemopoietic-specific early response protein | Protein BFL-1
Type:
Apoptosis regulator protein
Mol. Mass.:
19909.74
Organism:
Mus musculus (Mouse)
Description:
gi_11024684
Residue:
172
  
Inhibitor
Name:
BDBM79262
Synonyms:
KG-MS SMR001231045 | cid_25163007
Type:
Small organic molecule
Emp. Form.:
C60H103N17O8S
Mol. Mass.:
1222.634
SMILES:
CSCCCc1cn(nn1)[C@@H](CO)C(=O)NCCCCCCCCCCC(=O)N1CCN(CC1)c1nc(NCCOCCOCCOCC#C)nc(n1)N1CCN(CC1)C(=O)CCCCCCCCCCNC(=O)Cn1cc(CCCCCN)nn1
: