Target
Tropomyosin alpha-1 chain
Ligand
BDBM79680
Substrate
Meas. Tech.
Fluorescence-based biochemical high throughput dose response assay for activators of the calcium sensitivity of cardiac Regulated Thin Filaments (RTF)
EC50
5480±n/a nM
Citation
 PubChem, PC Fluorescence-based biochemical high throughput dose response assay for activators of the calcium sensitivity of cardiac Regulated Thin Filaments (RTF) PubChem Bioassay (2011)[AID] 
Target
Name:
Tropomyosin alpha-1 chain
Synonyms:
TPM1 cardiac alpha tropomyosin
Type:
Enzyme Catalytic Domain
Mol. Mass.:
32681.01
Organism:
Sus scrofa
Description:
P42639
Residue:
284
  
Inhibitor
Name:
BDBM79680
Synonyms:
(5Z)-1-(4-methylphenyl)-5-[(E)-3-phenylazanylprop-2-enylidene]-1,3-diazinane-2,4,6-trione (5Z)-5-[(E)-3-anilinoprop-2-enylidene]-1-(p-tolyl)barbituric acid MLS000587900 cid_6049677
Type:
Small organic molecule
Emp. Form.:
C20H17N3O3
Mol. Mass.:
347.3673
SMILES:
Cc1ccc(cc1)-n1c(O)c(C=CC=Nc2ccccc2)c(=O)[nH]c1=O
: