Target
Orexin/Hypocretin receptor type 1
Ligand
BDBM79930
Substrate
Meas. Tech.
Fluorescence-based cell-based high throughput dose response assay for antagonists of the orexin 1 receptor (OX1R; HCRTR1)
IC50
3034±n/a nM
Citation
 PubChem, PC Fluorescence-based cell-based high throughput dose response assay for antagonists of the orexin 1 receptor (OX1R; HCRTR1) PubChem Bioassay (2011)[AID] 
Target
Name:
Orexin/Hypocretin receptor type 1
Synonyms:
HCRTR1 OX1R_HUMAN Orexin receptor type 1 (OR 1) Orexin receptor type 1 (OX1) Orexin receptor type 1 (OxR1) | Ox1r
Type:
Protein
Mol. Mass.:
47554.50
Organism:
Homo sapiens (Human)
Description:
O43613
Residue:
425
  
Inhibitor
Name:
BDBM79930
Synonyms:
MLS001076936 N-(3,5-dimethylphenyl)-1-(8-quinolylsulfonyl)pyrrolidine-2-carboxamide N-(3,5-dimethylphenyl)-1-quinolin-8-ylsulfonylpyrrolidine-2-carboxamide cid_20880646
Type:
Small organic molecule
Emp. Form.:
C22H23N3O3S
Mol. Mass.:
409.501
SMILES:
Cc1cc(C)cc(NC(=O)C2CCCN2S(=O)(=O)c2cccc3cccnc23)c1
: