Target
Orexin/Hypocretin receptor type 1
Ligand
BDBM65662
Substrate
Meas. Tech.
Fluorescence-based cell-based high throughput dose response assay for antagonists of the orexin 1 receptor (OX1R; HCRTR1)
IC50
2583±n/a nM
Citation
 PubChem, PC Fluorescence-based cell-based high throughput dose response assay for antagonists of the orexin 1 receptor (OX1R; HCRTR1) PubChem Bioassay (2011)[AID] 
Target
Name:
Orexin/Hypocretin receptor type 1
Synonyms:
HCRTR1 OX1R_HUMAN Orexin receptor type 1 (OR 1) Orexin receptor type 1 (OX1) Orexin receptor type 1 (OxR1) | Ox1r
Type:
Protein
Mol. Mass.:
47554.50
Organism:
Homo sapiens (Human)
Description:
O43613
Residue:
425
  
Inhibitor
Name:
BDBM65662
Synonyms:
2-ethoxy-N-(12-keto-7,8,9,10-tetrahydro-6H-azepino[2,1-b]quinazolin-2-yl)benzamide 2-ethoxy-N-(12-oxo-7,8,9,10-tetrahydro-6H-azepino[2,1-b]quinazolin-2-yl)benzamide SMR000624740 | cid_24793679
Type:
Small organic molecule
Emp. Form.:
C22H23N3O3
Mol. Mass.:
377.4363
SMILES:
CCOc1ccccc1C(=O)Nc1ccc2nc3CCCCCn3c(=O)c2c1
: