Target
Orexin/Hypocretin receptor type 1
Ligand
BDBM79967
Substrate
Meas. Tech.
Fluorescence-based cell-based high throughput dose response assay for antagonists of the orexin 1 receptor (OX1R; HCRTR1)
IC50
3234±n/a nM
Citation
 PubChem, PC Fluorescence-based cell-based high throughput dose response assay for antagonists of the orexin 1 receptor (OX1R; HCRTR1) PubChem Bioassay (2011)[AID] 
Target
Name:
Orexin/Hypocretin receptor type 1
Synonyms:
HCRTR1 OX1R_HUMAN Orexin receptor type 1 (OR 1) Orexin receptor type 1 (OX1) Orexin receptor type 1 (OxR1) | Ox1r
Type:
Protein
Mol. Mass.:
47554.50
Organism:
Homo sapiens (Human)
Description:
O43613
Residue:
425
  
Inhibitor
Name:
BDBM79967
Synonyms:
2-[(1S,3R,12bS)-12b-ethyl-1-[4-(2-furoyl)piperazine-1-carbonyl]-10-(2-furyl)-4-keto-1,2,3,6,7,12-hexahydropyrido[2,1-a]-carbolin-3-yl]-N-[(2E)-3,7-dimethylocta-2,6-dienyl]acetamide 2-[(1S,3R,12bS)-12b-ethyl-10-(2-furanyl)-1-[[4-[2-furanyl(oxo)methyl]-1-piperazinyl]-oxomethyl]-4-oxo-1,2,3,6,7,12-hexahydroindolo[2,3-a]quinolizin-3-yl]-N-[(2E)-3,7-dimethylocta-2,6-dienyl]acetamide MLS002642845 cid_44601856
Type:
Small organic molecule
Emp. Form.:
C43H51N5O6
Mol. Mass.:
733.8949
SMILES:
CC[C@@]12[C@H](C[C@H](CC(=O)NC\C=C(/C)CCC=C(C)C)C(=O)N1CCc1c2[nH]c2cc(ccc12)-c1ccco1)C(=O)N1CCN(CC1)C(=O)c1ccco1
: