Target
Orexin/Hypocretin receptor type 1
Ligand
BDBM40064
Substrate
Meas. Tech.
Homogeneous Time Resolved Fluorescence (HTRF)-based cell-based high throughput dose response assay for antagonists of the orexin 1 receptor (OX1R; HCRTR1)
IC50
54.78±n/a nM
Citation
 PubChem, PC Homogeneous Time Resolved Fluorescence (HTRF)-based cell-based high throughput dose response assay for antagonists of the orexin 1 receptor (OX1R; HCRTR1) PubChem Bioassay (2011)[AID] 
Target
Name:
Orexin/Hypocretin receptor type 1
Synonyms:
HCRTR1 OX1R_HUMAN Orexin receptor type 1 (OR 1) Orexin receptor type 1 (OX1) Orexin receptor type 1 (OxR1) | Ox1r
Type:
Protein
Mol. Mass.:
47554.50
Organism:
Homo sapiens (Human)
Description:
O43613
Residue:
425
  
Inhibitor
Name:
BDBM40064
Synonyms:
MLS000050877 N-(9-ethyl-9H-carbazol-3-yl)-2-{[4-ethyl-5-(2-pyrazinyl)-4H-1,2,4-triazol-3-yl]thio}acetamide N-(9-ethylcarbazol-3-yl)-2-[(4-ethyl-5-pyrazin-2-yl-1,2,4-triazol-3-yl)sulfanyl]ethanamide SMR000078572 | cid_2218748
Type:
Small organic molecule
Emp. Form.:
C24H23N7OS
Mol. Mass.:
457.551
SMILES:
CCn1c(SCC(=O)Nc2ccc3n(CC)c4ccccc4c3c2)nnc1-c1cnccn1
: