Target
Orexin/Hypocretin receptor type 1
Ligand
BDBM79819
Substrate
Meas. Tech.
Homogeneous Time Resolved Fluorescence (HTRF)-based cell-based high throughput dose response assay for antagonists of the orexin 1 receptor (OX1R; HCRTR1)
IC50
315.04±n/a nM
Citation
 PubChem, PC Homogeneous Time Resolved Fluorescence (HTRF)-based cell-based high throughput dose response assay for antagonists of the orexin 1 receptor (OX1R; HCRTR1) PubChem Bioassay (2011)[AID] 
Target
Name:
Orexin/Hypocretin receptor type 1
Synonyms:
HCRTR1 OX1R_HUMAN Orexin receptor type 1 (OR 1) Orexin receptor type 1 (OX1) Orexin receptor type 1 (OxR1) | Ox1r
Type:
Protein
Mol. Mass.:
47554.50
Organism:
Homo sapiens (Human)
Description:
O43613
Residue:
425
  
Inhibitor
Name:
BDBM79819
Synonyms:
MLS000527511 N'-[2-(cyclopentylamino)-2-oxidanylidene-1-phenyl-ethyl]-N-(5-methyl-1,2-oxazol-3-yl)-N'-(thiophen-2-ylmethyl)butanediamide N'-[2-(cyclopentylamino)-2-oxo-1-phenylethyl]-N-(5-methyl-3-isoxazolyl)-N'-(thiophen-2-ylmethyl)butanediamide SMR000117985 | cid_3210705
Type:
Small organic molecule
Emp. Form.:
C26H30N4O4S
Mol. Mass.:
494.606
SMILES:
Cc1cc(NC(=O)CCC(=O)N(Cc2cccs2)C(C(=O)NC2CCCC2)c2ccccc2)no1
: