Target
Orexin/Hypocretin receptor type 1
Ligand
BDBM79843
Substrate
Meas. Tech.
Homogeneous Time Resolved Fluorescence (HTRF)-based cell-based high throughput dose response assay for antagonists of the orexin 1 receptor (OX1R; HCRTR1)
IC50
509.97±n/a nM
Citation
 PubChem, PC Homogeneous Time Resolved Fluorescence (HTRF)-based cell-based high throughput dose response assay for antagonists of the orexin 1 receptor (OX1R; HCRTR1) PubChem Bioassay (2011)[AID] 
Target
Name:
Orexin/Hypocretin receptor type 1
Synonyms:
HCRTR1 OX1R_HUMAN Orexin receptor type 1 (OR 1) Orexin receptor type 1 (OX1) Orexin receptor type 1 (OxR1) | Ox1r
Type:
Protein
Mol. Mass.:
47554.50
Organism:
Homo sapiens (Human)
Description:
O43613
Residue:
425
  
Inhibitor
Name:
BDBM79843
Synonyms:
(5E)-5-[(Z)-2-methyl-3-phenyl-prop-2-enylidene]-2-morpholin-4-yl-1,3-thiazol-4-one (5E)-5-[(Z)-2-methyl-3-phenylprop-2-enylidene]-2-(4-morpholinyl)-4-thiazolone 5-(2-methyl-3-phenyl-2-propen-1-ylidene)-2-(4-morpholinyl)-1,3-thiazol-4(5H)-one SMR000208950 | cid_682575
Type:
Small organic molecule
Emp. Form.:
C17H18N2O2S
Mol. Mass.:
314.402
SMILES:
C\C(\C=C1\SC(=NC1=O)N1CCOCC1)=C\c1ccccc1
: