Target
Orexin/Hypocretin receptor type 1
Ligand
BDBM79857
Substrate
Meas. Tech.
Homogeneous Time Resolved Fluorescence (HTRF)-based cell-based high throughput dose response assay for antagonists of the orexin 1 receptor (OX1R; HCRTR1)
IC50
264.35±n/a nM
Citation
 PubChem, PC Homogeneous Time Resolved Fluorescence (HTRF)-based cell-based high throughput dose response assay for antagonists of the orexin 1 receptor (OX1R; HCRTR1) PubChem Bioassay (2011)[AID] 
Target
Name:
Orexin/Hypocretin receptor type 1
Synonyms:
HCRTR1 OX1R_HUMAN Orexin receptor type 1 (OR 1) Orexin receptor type 1 (OX1) Orexin receptor type 1 (OxR1) | Ox1r
Type:
Protein
Mol. Mass.:
47554.50
Organism:
Homo sapiens (Human)
Description:
O43613
Residue:
425
  
Inhibitor
Name:
BDBM79857
Synonyms:
4-(4-chloro-2-methyl-phenoxy)-N-[2-[(5Z)-2,4-diketo-5-(3-pyridylmethylene)thiazolidin-3-yl]ethyl]butyramide 4-(4-chloro-2-methylphenoxy)-N-[2-[(5Z)-2,4-dioxo-5-(pyridin-3-ylmethylidene)-1,3-thiazolidin-3-yl]ethyl]butanamide N-[2-[(5Z)-2,4-bis(oxidanylidene)-5-(pyridin-3-ylmethylidene)-1,3-thiazolidin-3-yl]ethyl]-4-(4-chloranyl-2-methyl-phenoxy)butanamide cid_6533320
Type:
Small organic molecule
Emp. Form.:
C22H22ClN3O4S
Mol. Mass.:
459.946
SMILES:
Cc1cc(Cl)ccc1OCCCC(=O)NCCN1C(=O)S\C(=C/c2cccnc2)C1=O
: