Target
Orexin/Hypocretin receptor type 1
Ligand
BDBM79944
Substrate
Meas. Tech.
Homogeneous Time Resolved Fluorescence (HTRF)-based cell-based high throughput dose response assay for antagonists of the orexin 1 receptor (OX1R; HCRTR1)
IC50
353.89±n/a nM
Citation
 PubChem, PC Homogeneous Time Resolved Fluorescence (HTRF)-based cell-based high throughput dose response assay for antagonists of the orexin 1 receptor (OX1R; HCRTR1) PubChem Bioassay (2011)[AID] 
Target
Name:
Orexin/Hypocretin receptor type 1
Synonyms:
HCRTR1 OX1R_HUMAN Orexin receptor type 1 (OR 1) Orexin receptor type 1 (OX1) Orexin receptor type 1 (OxR1) | Ox1r
Type:
Protein
Mol. Mass.:
47554.50
Organism:
Homo sapiens (Human)
Description:
O43613
Residue:
425
  
Inhibitor
Name:
BDBM79944
Synonyms:
MLS001080195 N-[2-[(5Z)-2,4-diketo-5-(3-pyridylmethylene)thiazolidin-3-yl]ethyl]-5-keto-1-[3-(methylthio)phenyl]pyrrolidine-3-carboxamide N-[2-[(5Z)-2,4-dioxo-5-(pyridin-3-ylmethylidene)-1,3-thiazolidin-3-yl]ethyl]-1-(3-methylsulfanylphenyl)-5-oxopyrrolidine-3-carboxamide cid_24979400
Type:
Small organic molecule
Emp. Form.:
C23H22N4O4S2
Mol. Mass.:
482.575
SMILES:
CSc1cccc(c1)N1CC(CC1=O)C(=O)NCCN1C(=O)S\C(=C/c2cccnc2)C1=O
: