Target
Orexin/Hypocretin receptor type 1
Ligand
BDBM79949
Substrate
Meas. Tech.
Homogeneous Time Resolved Fluorescence (HTRF)-based cell-based high throughput dose response assay for antagonists of the orexin 1 receptor (OX1R; HCRTR1)
IC50
238.29±n/a nM
Citation
 PubChem, PC Homogeneous Time Resolved Fluorescence (HTRF)-based cell-based high throughput dose response assay for antagonists of the orexin 1 receptor (OX1R; HCRTR1) PubChem Bioassay (2011)[AID] 
Target
Name:
Orexin/Hypocretin receptor type 1
Synonyms:
HCRTR1 OX1R_HUMAN Orexin receptor type 1 (OR 1) Orexin receptor type 1 (OX1) Orexin receptor type 1 (OxR1) | Ox1r
Type:
Protein
Mol. Mass.:
47554.50
Organism:
Homo sapiens (Human)
Description:
O43613
Residue:
425
  
Inhibitor
Name:
BDBM79949
Synonyms:
2-[1-(2-chlorophenyl)ethylamino]-N-(3-piperidin-1-ylsulfonylphenyl)propanamide 2-[1-(2-chlorophenyl)ethylamino]-N-[3-(1-piperidinylsulfonyl)phenyl]propanamide SMR001252074 | cid_16309185
Type:
Small organic molecule
Emp. Form.:
C22H28ClN3O3S
Mol. Mass.:
449.994
SMILES:
CC(NC(C)c1ccccc1Cl)C(=O)Nc1cccc(c1)S(=O)(=O)N1CCCCC1
: