Target
Beta-galactosidase
Ligand
BDBM48177
Substrate
Meas. Tech.
HTS Dose response counterscreen for assays utilizing the enzyme, beta-galactosidase - Set 3
IC50
>66600±0 nM
Citation
 PubChem, PC HTS Dose response counterscreen for assays utilizing the enzyme, beta-galactosidase - Set 3 PubChem Bioassay (2011)[AID] 
Target
Name:
Beta-galactosidase
Synonyms:
BGAL_ECOLX Lactase | lacZ
Type:
PROTEIN
Mol. Mass.:
116943.87
Organism:
Escherichia coli
Description:
ChEMBL_215882
Residue:
1029
  
Inhibitor
Name:
BDBM48177
Synonyms:
MLS000106138 cid_3103803
Type:
Small organic molecule
Emp. Form.:
C27H38N4O
Mol. Mass.:
434.6168
SMILES:
CN1CCN(CC(=O)N2CCn3c4C2CCCc4c2cc(ccc32)C2CCCCC2)CC1
: