Target
DNA dC->dU-editing enzyme APOBEC-3G
Ligand
BDBM80177
Substrate
Meas. Tech.
Dose Response confirmation of small molecule APOBEC3G DNA Deaminase Inhibitors via a fluorescence-based single-stranded DNA deaminase assay
Temperature
298.15±n/a K
IC50
2330±n/a nM
Comments
extracted
Citation
 PubChem, PC Dose Response confirmation of small molecule APOBEC3G DNA Deaminase Inhibitors via a fluorescence-based single-stranded DNA deaminase assay PubChem Bioassay (2011)[AID] 
Target
Name:
DNA dC->dU-editing enzyme APOBEC-3G
Synonyms:
ABC3G_HUMAN | APOBEC3G
Type:
Enzyme Catalytic Domain
Mol. Mass.:
46419.54
Organism:
Homo sapiens (Human)
Description:
gi_13399304
Residue:
384
  
Inhibitor
Name:
BDBM80177
Synonyms:
4-[(E)-3-Phenyl-prop-2-en-(E)-ylideneamino]-5-pyridin-3-yl-4H-[1,2,4]triazole-3-thiol 4-[[(E)-3-phenylprop-2-enylidene]amino]-3-(3-pyridyl)-1H-1,2,4-triazole-5-thione MLS000594921 cid_1961508
Type:
Small organic molecule
Emp. Form.:
C16H13N5S
Mol. Mass.:
307.373
SMILES:
S=c1[nH]nc(-c2cccnc2)n1N=CC=Cc1ccccc1
: