Target
DNA dC->dU-editing enzyme APOBEC-3A
Ligand
BDBM80103
Substrate
Meas. Tech.
Dose Response confirmation of APOBEC3G DNA Deaminase Inhibitors via a A3A counterscreen
Temperature
298.15±n/a K
IC50
>100000±n/a nM
Comments
extracted
Citation
 PubChem, PC Dose Response confirmation of APOBEC3G DNA Deaminase Inhibitors via a A3A counterscreen PubChem Bioassay (2011)[AID] 
Target
Name:
DNA dC->dU-editing enzyme APOBEC-3A
Synonyms:
ABC3A_HUMAN probable DNA dC->dU-editing enzyme APOBEC-3A
Type:
Enzyme Catalytic Domain
Mol. Mass.:
23013.77
Organism:
Homo sapiens (Human)
Description:
gi_21955158
Residue:
199
  
Inhibitor
Name:
BDBM80103
Synonyms:
6-keto-3-phenyl-8-(2-thienyl)-2,4,7,8-tetrahydropyrido[2,1-b][1,3,5]thiadiazine-9-carbonitrile 6-oxo-3-phenyl-8-thiophen-2-yl-2,4,7,8-tetrahydropyrido[2,1-b][1,3,5]thiadiazine-9-carbonitrile SMR000035442 | cid_667120
Type:
Small organic molecule
Emp. Form.:
C18H15N3OS2
Mol. Mass.:
353.461
SMILES:
O=C1CC(c2cccs2)C(C#N)=C2SCN(CN12)c1ccccc1
: