Target
DNA dC->dU-editing enzyme APOBEC-3A
Ligand
BDBM62839
Substrate
Meas. Tech.
Dose Response confirmation of APOBEC3G DNA Deaminase Inhibitors via a A3A counterscreen
Temperature
298.15±n/a K
IC50
>100000±n/a nM
Comments
extracted
Citation
 PubChem, PC Dose Response confirmation of APOBEC3G DNA Deaminase Inhibitors via a A3A counterscreen PubChem Bioassay (2011)[AID] 
Target
Name:
DNA dC->dU-editing enzyme APOBEC-3A
Synonyms:
ABC3A_HUMAN probable DNA dC->dU-editing enzyme APOBEC-3A
Type:
Enzyme Catalytic Domain
Mol. Mass.:
23013.77
Organism:
Homo sapiens (Human)
Description:
gi_21955158
Residue:
199
  
Inhibitor
Name:
BDBM62839
Synonyms:
5,5-dimethyl-2,6-dihydro-[1,2,4]triazol[3,4-a]isoquinoline-3-thione MLS000107006 US10864248, Compound 3 | cid_870599
Type:
Small organic molecule
Emp. Form.:
C12H13N3S
Mol. Mass.:
231.317
SMILES:
CC1(C)Cc2ccccc2-c2n[nH]c(=S)n12
: