Target
DNA dC->dU-editing enzyme APOBEC-3G
Ligand
BDBM80600
Substrate
Meas. Tech.
Dose Response confirmation of APOBEC3A DNA Deaminase Inhibitors via a A3G counterscreen
Temperature
298.15±n/a K
IC50
2440±198 nM
Comments
extracted
Citation
 PubChem, PC Dose Response confirmation of APOBEC3A DNA Deaminase Inhibitors via a A3G counterscreen PubChem Bioassay (2011)[AID] 
Target
Name:
DNA dC->dU-editing enzyme APOBEC-3G
Synonyms:
ABC3G_HUMAN | APOBEC3G
Type:
Enzyme Catalytic Domain
Mol. Mass.:
46419.54
Organism:
Homo sapiens (Human)
Description:
gi_13399304
Residue:
384
  
Inhibitor
Name:
BDBM80600
Synonyms:
(4S)-1-ethyl-2-(4-hydroxybutylamino)-6-methyl-4-[3-(trifluoromethyl)phenyl]-4H-pyrimidine-5-carboxylic acid methyl ester SMR000672051 methyl (4S)-1-ethyl-2-(4-hydroxybutylamino)-6-methyl-4-[3-(trifluoromethyl)phenyl]-4H-pyrimidine-5-carboxylate | methyl (4S)-1-ethyl-6-methyl-2-(4-oxidanylbutylamino)-4-[3-(trifluoromethyl)phenyl]-4H-pyrimidine-5-carboxylate
Type:
Small organic molecule
Emp. Form.:
C20H26F3N3O3
Mol. Mass.:
413.4339
SMILES:
CCN1C(C)=C([C@@H](N=C1NCCCCO)c1cccc(c1)C(F)(F)F)C(=O)OC
: