Target
C-C chemokine receptor type 6
Ligand
BDBM54743
Substrate
Meas. Tech.
Dose Response confirmation of small molecule antagonists of the CCR6 receptor: a luminescent beta-arrestin assay
IC50
15000±n/a nM
Citation
 PubChem, PC Dose Response confirmation of small molecule antagonists of the CCR6 receptor: a luminescent beta-arrestin assay PubChem Bioassay (2011)[AID] 
Target
Name:
C-C chemokine receptor type 6
Synonyms:
C-C chemokine receptor type 6 CCR6 CKRL3 GPR29 | STRL22
Type:
Enzyme
Mol. Mass.:
42510.84
Organism:
Homo sapiens (Human)
Description:
P51684
Residue:
374
  
Inhibitor
Name:
BDBM54743
Synonyms:
1-(4-piperidin-1-ylphenyl)pyrrole-2,5-dione 1-[4-(1-piperidinyl)phenyl]pyrrole-2,5-dione SMR000289810 | cid_512832
Type:
Small organic molecule
Emp. Form.:
C15H16N2O2
Mol. Mass.:
256.2997
SMILES:
O=C1C=CC(=O)N1c1ccc(cc1)N1CCCCC1
: