Target
Hexokinase HKDC1 [W721R]
Ligand
BDBM68913
Substrate
Meas. Tech.
Dose Response confirmation of inhibitors of hexokinase domain containing I (HKDC1)
IC50
1680±n/a nM
Citation
 PubChem, PC Dose Response confirmation of inhibitors of hexokinase domain containing I (HKDC1) PubChem Bioassay (2011)[AID] 
Target
Name:
Hexokinase HKDC1 [W721R]
Synonyms:
HKDC1 putative hexokinase HKDC1
Type:
Enzyme Catalytic Domain
Mol. Mass.:
102520.24
Organism:
Homo sapiens (Human)
Description:
gi_156151420
Residue:
917
  
Inhibitor
Name:
BDBM68913
Synonyms:
(4E)-4-[[(5-bromo-2-pyrimidinyl)hydrazo]methylidene]-3-hydroxy-1-cyclohexa-2,5-dienone (4E)-4-[[2-(5-bromopyrimidin-2-yl)hydrazinyl]methylidene]-3-hydroxycyclohexa-2,5-dien-1-one 2,4-dihydroxybenzaldehyde (5-bromo-2-pyrimidinyl)hydrazone SMR000185486 | cid_6509203
Type:
Small organic molecule
Emp. Form.:
C11H9BrN4O2
Mol. Mass.:
309.119
SMILES:
Oc1ccc(CN=Nc2ncc(Br)cn2)c(O)c1
: