Target
Hexokinase HKDC1 [W721R]
Ligand
BDBM50273
Substrate
Meas. Tech.
Dose Response confirmation of inhibitors of hexokinase domain containing I (HKDC1)
IC50
4720±n/a nM
Citation
 PubChem, PC Dose Response confirmation of inhibitors of hexokinase domain containing I (HKDC1) PubChem Bioassay (2011)[AID] 
Target
Name:
Hexokinase HKDC1 [W721R]
Synonyms:
HKDC1 putative hexokinase HKDC1
Type:
Enzyme Catalytic Domain
Mol. Mass.:
102520.24
Organism:
Homo sapiens (Human)
Description:
gi_156151420
Residue:
917
  
Inhibitor
Name:
BDBM50273
Synonyms:
2-[1-hydroxy-4-[(2,4,5-trimethylphenyl)sulfonylamino]naphthalen-2-yl]sulfanylacetic acid 2-[[1-hydroxy-4-[(2,4,5-trimethylphenyl)sulfonylamino]-2-naphthalenyl]thio]acetic acid MLS000697055 cid_6710564
Type:
Small organic molecule
Emp. Form.:
C21H21NO5S2
Mol. Mass.:
431.525
SMILES:
Cc1cc(C)c(cc1C)S(=O)(=O)Nc1cc(SCC(O)=O)c(O)c2ccccc12
: