Target
Hexokinase HKDC1 [W721R]
Ligand
BDBM80766
Substrate
Meas. Tech.
Dose Response confirmation of activators of hexokinase domain containing I (HKDC1)
EC50
8740±n/a nM
Citation
 PubChem, PC Dose Response confirmation of activators of hexokinase domain containing I (HKDC1) PubChem Bioassay (2011)[AID] 
Target
Name:
Hexokinase HKDC1 [W721R]
Synonyms:
HKDC1 putative hexokinase HKDC1
Type:
Enzyme Catalytic Domain
Mol. Mass.:
102520.24
Organism:
Homo sapiens (Human)
Description:
gi_156151420
Residue:
917
  
Inhibitor
Name:
BDBM80766
Synonyms:
2-(7-fluoro-2-methyl-4-thiazolo[5,4-b]indolyl)acetic acid methyl ester MLS000084626 cid_666834 methyl 2-(7-fluoro-2-methyl-[1,3]thiazolo[5,4-b]indol-4-yl)acetate
Type:
Small organic molecule
Emp. Form.:
C13H11FN2O2S
Mol. Mass.:
278.302
SMILES:
COC(=O)Cn1c2ccc(F)cc2c2nc(C)sc12
: