Target
Hexokinase HKDC1 [W721R]
Ligand
BDBM80770
Substrate
Meas. Tech.
Dose Response confirmation of activators of hexokinase domain containing I (HKDC1)
EC50
31800±n/a nM
Citation
 PubChem, PC Dose Response confirmation of activators of hexokinase domain containing I (HKDC1) PubChem Bioassay (2011)[AID] 
Target
Name:
Hexokinase HKDC1 [W721R]
Synonyms:
HKDC1 putative hexokinase HKDC1
Type:
Enzyme Catalytic Domain
Mol. Mass.:
102520.24
Organism:
Homo sapiens (Human)
Description:
gi_156151420
Residue:
917
  
Inhibitor
Name:
BDBM80770
Synonyms:
4-(3-bromophenyl)-1,3-thiazol-2-amine MLS000539317 [4-(3-bromophenyl)thiazol-2-yl]amine | cid_723330
Type:
Small organic molecule
Emp. Form.:
C9H7BrN2S
Mol. Mass.:
255.134
SMILES:
Nc1nc(cs1)-c1cccc(Br)c1
: